{"text_format":"1","workbook":"xlsx","n_sheets":9,"sheets":["Analysis","AI Spreads","RiskNotching","Face Page Input","AI Prompt","Sheet1","Ranges","Wording","FP Dropdowns & OTher"],"not_rendered":{"charts":0,"images":2,"macros":1,"external_links":1,"defined_names":8,"comments":1,"pivot_tables":0},"unopened":[],"bounds":{"document_bytes":16777216,"sheet_cells":100000,"rows_first":2000,"rows_last":500,"rows_between":2000,"halvings":0,"cell_chars":16384,"cell_head_chars":4096},"cells_cut":0,"cells_raw":0,"read":"whole","date_system":"1900"}

{"sheet":"Analysis","index":0,"n_rows":173,"n_cols":10,"rows_kept":173,"cut":false,"hidden":false,"merged":[]}
["Rikkel Corp",null,null,null,null,"Target Period",{"$f":"C3","v":"2024-12-31"}]
["Password: risk",null,null,null,null,"In Thousands?","Yes"]
[null,"2023-12-31","2024-12-31","2025-03-31",null,null,null,"Override"]
["Revenue",99228,102503,22089,null,"Revenue is (Satisfactory)",{"$f":"IF(G2=\"No\",IF(H4=\"\",_xlfn.IFS(Analysis!C4/1000000>Ranges!C2,Wording!A2,AND(Analysis!C4/1000000<=Ranges!C2,Analysis!C4/1000000>=Ranges!C4),Wording!A3,Analysis!C4/1000000<Ranges!C4,Wording!A4),H4),IF(H4=\"\",_xlfn.IFS(Analysis!C4/1000>Ranges!C2,Wording!A2,AND(Analysis!C4/1000<=Ranges!C2,Analysis!C4/1000>=Ranges!C4),Wording!A3,Analysis!C4/1000<Ranges!C4,Wording!A4),H4))","v":"satisfactory"},null,null,"Financial Analysis"]
["Net Operating Profit",4242,2723,724,null,"Net Revenue (increasing)",{"$f":"IF(H5=\"\",IF((C4/B4)-1<0,Wording!B3,Wording!B2),H5)","v":"increasing "},null,null,"Revenue and Profitability"]
["Net Income",2461,1510,548,null,"Revenue Change % ",{"$f":"IF(H6=\"\",ABS((C4/B4)-1),H6)","v":3.3004797033095556E-2},null,null,{"$f":"\"•    Revenue is \" & G4 & \" with revenues \" & G5 & \" \" & ROUND((G6*100),1) & \"% in \" & G7 & \" to $\" & ROUND(G8,1) & \"MM.\"","v":"•    Revenue is satisfactory with revenues increasing  3.3% in 2024 to $102.5MM."}]
["Cash",1395,157,308,null,"Target Period",{"$f":"IF(H7=\"\",YEAR(G1),H7)","v":2024},null,null,{"$f":"\"•    Net operating profit of \"&IF(G10<0,\"-$\"&ROUND(ABS(G10),1) &\"MM with \"& G11 &\" operating margin of \"&ROUND((G12*100),1)&\"%.\",\"$\"&ROUND(G10,1) &\"MM with \"&G11&\" operating margin of \"&ROUND((G12*100),1)&\"%.\")","v":"•    Net operating profit of $2.7MM with improved operating margin of 2.7%."}]
["Time Deposits",null,null,null,null,"Revenue for Target Period",{"$f":"IF(H8=\"\",IF(G2=\"No\",C4/1000000,C4/1000),H8)","v":102.503},null,null,{"$f":"\"•    Profitability is \" & G14 & \" as evidenced by their \" & G15 & \" net margin of \" & ROUND(G16*100,1) & \"% with \" & IF(G18<0,\"-$\" & ROUND(ABS(G18),1), \"$\" & ROUND(G18,1)) & \"MM in \" & G19 & \".\"","v":"•    Profitability is sufficient as evidenced by their contracting net margin of 1.5% with $1.5MM in net income."}]
["Marketable Securities"]
["Restricted Liq. Assets (Manual)",null,null,null,null,"Net Operating Profit X",{"$f":"IF(H10=\"\",IF(G2=\"No\",C5/1000000,C5/1000),H10)","v":2.7229999999999999},null,null,"Liquidity and Cash Flow"]
["Total Liquid Assets Avaialbe",{"$f":"SUM(B7:B9)-B10","v":1395},{"$f":"SUM(C7:C9)-C10","v":157},308,null,"Net Operating Profit is (Improving)",{"$f":"IF(H11=\"\",IF(C5/B5>0,Wording!D2,Wording!D3),H11)","v":"improved"},null,null,{"$f":"\"•    Liquidity is \" & G20 & \" as evidenced by their quick ratio of \" & ROUND(G21,2) & \"x and current ratio of \" & ROUND(G22,2) & \"x with $\" & ROUND(G23,1) & \"MM in cash.\"","v":"•    Liquidity is sufficient as evidenced by their quick ratio of 0.11x and current ratio of 1.26x with $0.2MM in cash."}]
["Quick Ratio",0.16011759046827659,0.10915645695460199,0.14390601297178701,null,"Change in Net Operting Margin",{"$f":"IF(H12=\"\",C5/C4,H12)","v":2.6565076144112854E-2},null,null,{"$f":"\"•    Working Capital is \" & IF(G25<0,\"-$\" & ROUND(ABS(G25),1), \"$\" & ROUND(G25,1)) & \"MM showing \" &G27 & \" coverage of current liabilities.\"","v":"•    Working Capital is $3.4MM showing sufficient coverage of current liabilities."}]
["Current Ratio",1.2185163443829641,1.2636475517363559,1.316646465133515,null,null,null,null,null,{"$f":"\"•    The company has \" & G29 & \" cashflow with \" & IF(G30 <0,\"-$\" & ROUND(ABS(G30),1), \"$\" & ROUND(G30,1)) & \"MM in EBITDA and net \"  & G31 & \" in cash of \" & IF(G32<0,\"-$\" & ROUND(ABS(G32),1), \"$\" & ROUND(G32,1)) & \"MM YOY.\"","v":"•    The company has satisfactory cashflow with $2.8MM in EBITDA and net decrease in cash of -$1.2MM YOY."}]
["Working Capital",2708.86,3411.57,3861.38,null,"Profitability is (Satisfatory)",{"$f":"IF(H14=\"\",_xlfn.IFS(C6/C4>Ranges!C6,Wording!F2,AND(C6/C4<=Ranges!C6,C6/C4>=Ranges!C8),Wording!F3,C6/C4<Ranges!C8,Wording!F4),)","v":"sufficient"}]
["EBITDA",4242,2750,751,null,"as evidenced by (Improving)",{"$f":"IF(H15=\"\",IF(C6/C4>B6/B4,Wording!G2,Wording!G3),H15)","v":"contracting"},null,null,"Solvency and Leverage"]
{"$rows_left_out":159}
{"sheet":"AI Spreads","index":1,"n_rows":215,"n_cols":11,"rows_kept":215,"cut":false,"hidden":false,"merged":[]}
["mapped to:","Account Name",2024,"Mar-2025 YTD",null,null,null,null,{"$f":"C1","v":2024},{"$f":"D1","v":"Mar-2025 YTD"},{"$f":"[1]Mapping!L1","v":0}]
["Income Statement",null,null,null,null,null,null,"Income Statement"]
["Sales","Revenue - Services",0,26765198,null,null,null,"Revenue",{"$f":"SUMIF([1]Mapping!$A$1:$A$500,[1]Spreads!$A3,[1]Mapping!C$1:C$500)","v":{"$error":"#VALUE!"}},{"$f":"SUMIF([1]Mapping!$A$1:$A$500,[1]Spreads!$A3,[1]Mapping!D$1:D$500)","v":{"$error":"#VALUE!"}},{"$f":"SUMIF([1]Mapping!$A$1:$A$500,[1]Spreads!$A3,[1]Mapping!E$1:E$500)","v":{"$error":"#VALUE!"}}]
["Sales","41007-Auction",553523,0,null,null,null,"Sales",{"$f":"SUMIF([1]Mapping!$A$1:$A$500,[1]Spreads!$A4,[1]Mapping!C$1:C$500)","v":{"$error":"#VALUE!"}},{"$f":"SUMIF([1]Mapping!$A$1:$A$500,[1]Spreads!$A4,[1]Mapping!D$1:D$500)","v":{"$error":"#VALUE!"}},{"$f":"SUMIF([1]Mapping!$A$1:$A$500,[1]Spreads!$A4,[1]Mapping!E$1:E$500)","v":{"$error":"#VALUE!"}}]
["Sales","41100-Investment Sales",92845218,0,null,null,null,"Returns & Allowances (-)",{"$f":"SUMIF([1]Mapping!$A$1:$A$500,[1]Spreads!$A5,[1]Mapping!C$1:C$500)","v":{"$error":"#VALUE!"}},{"$f":"SUMIF([1]Mapping!$A$1:$A$500,[1]Spreads!$A5,[1]Mapping!D$1:D$500)","v":{"$error":"#VALUE!"}},{"$f":"SUMIF([1]Mapping!$A$1:$A$500,[1]Spreads!$A5,[1]Mapping!E$1:E$500)","v":{"$error":"#VALUE!"}}]
["Sales","41105-Financing Fees",4053413,0,null,null,null,"Discounts (-)",{"$f":"SUMIF([1]Mapping!$A$1:$A$500,[1]Spreads!$A6,[1]Mapping!C$1:C$500)","v":{"$error":"#VALUE!"}},{"$f":"SUMIF([1]Mapping!$A$1:$A$500,[1]Spreads!$A6,[1]Mapping!D$1:D$500)","v":{"$error":"#VALUE!"}},{"$f":"SUMIF([1]Mapping!$A$1:$A$500,[1]Spreads!$A6,[1]Mapping!E$1:E$500)","v":{"$error":"#VALUE!"}}]
["Sales","41200 - Leasing",9241688,0,null,null,null,"Net Revenue",{"$f":"SUMIF([1]Mapping!$A$1:$A$500,[1]Spreads!$A7,[1]Mapping!C$1:C$500)","v":{"$error":"#VALUE!"}},{"$f":"SUMIF([1]Mapping!$A$1:$A$500,[1]Spreads!$A7,[1]Mapping!D$1:D$500)","v":{"$error":"#VALUE!"}},{"$f":"SUMIF([1]Mapping!$A$1:$A$500,[1]Spreads!$A7,[1]Mapping!E$1:E$500)","v":{"$error":"#VALUE!"}}]
["Sales","41700-Referral Fees",579740,0,null,null,null,"Direct Costs",{"$f":"SUMIF([1]Mapping!$A$1:$A$500,[1]Spreads!$A8,[1]Mapping!C$1:C$500)","v":{"$error":"#VALUE!"}},{"$f":"SUMIF([1]Mapping!$A$1:$A$500,[1]Spreads!$A8,[1]Mapping!D$1:D$500)","v":{"$error":"#VALUE!"}},{"$f":"SUMIF([1]Mapping!$A$1:$A$500,[1]Spreads!$A8,[1]Mapping!E$1:E$500)","v":{"$error":"#VALUE!"}}]
["Sales","41800-BOR Fees",83788,0,null,null,null,"COGS",{"$f":"SUMIF([1]Mapping!$A$1:$A$500,[1]Spreads!$A9,[1]Mapping!C$1:C$500)","v":{"$error":"#VALUE!"}},{"$f":"SUMIF([1]Mapping!$A$1:$A$500,[1]Spreads!$A9,[1]Mapping!D$1:D$500)","v":{"$error":"#VALUE!"}},{"$f":"SUMIF([1]Mapping!$A$1:$A$500,[1]Spreads!$A9,[1]Mapping!E$1:E$500)","v":{"$error":"#VALUE!"}}]
[null,"Total Revenue - Services",107357369,0,null,null,null,"COGS - Depreciation",{"$f":"SUMIF([1]Mapping!$A$1:$A$500,[1]Spreads!$A10,[1]Mapping!C$1:C$500)","v":{"$error":"#VALUE!"}},{"$f":"SUMIF([1]Mapping!$A$1:$A$500,[1]Spreads!$A10,[1]Mapping!D$1:D$500)","v":{"$error":"#VALUE!"}},{"$f":"SUMIF([1]Mapping!$A$1:$A$500,[1]Spreads!$A10,[1]Mapping!E$1:E$500)","v":{"$error":"#VALUE!"}}]
["COGS","Cost of Services",0,15676248,null,null,null,"Total Direct Costs",{"$f":"SUMIF([1]Mapping!$A$1:$A$500,[1]Spreads!$A11,[1]Mapping!C$1:C$500)","v":{"$error":"#VALUE!"}},{"$f":"SUMIF([1]Mapping!$A$1:$A$500,[1]Spreads!$A11,[1]Mapping!D$1:D$500)","v":{"$error":"#VALUE!"}},{"$f":"SUMIF([1]Mapping!$A$1:$A$500,[1]Spreads!$A11,[1]Mapping!E$1:E$500)","v":{"$error":"#VALUE!"}}]
["COGS","51000-Financing",2094510,0,null,null,null,"Gross Profit",{"$f":"SUMIF([1]Mapping!$A$1:$A$500,[1]Spreads!$A12,[1]Mapping!C$1:C$500)","v":{"$error":"#VALUE!"}},{"$f":"SUMIF([1]Mapping!$A$1:$A$500,[1]Spreads!$A12,[1]Mapping!D$1:D$500)","v":{"$error":"#VALUE!"}},{"$f":"SUMIF([1]Mapping!$A$1:$A$500,[1]Spreads!$A12,[1]Mapping!E$1:E$500)","v":{"$error":"#VALUE!"}}]
["COGS","51007-Auction",278818,0,null,null,null,"Operating Expenses",{"$f":"SUMIF([1]Mapping!$A$1:$A$500,[1]Spreads!$A13,[1]Mapping!C$1:C$500)","v":{"$error":"#VALUE!"}},{"$f":"SUMIF([1]Mapping!$A$1:$A$500,[1]Spreads!$A13,[1]Mapping!D$1:D$500)","v":{"$error":"#VALUE!"}},{"$f":"SUMIF([1]Mapping!$A$1:$A$500,[1]Spreads!$A13,[1]Mapping!E$1:E$500)","v":{"$error":"#VALUE!"}}]
["COGS","51100-Investment Sales",53914559,0,null,null,null,"General & Admin Expense",{"$f":"SUMIF([1]Mapping!$A$1:$A$500,[1]Spreads!$A14,[1]Mapping!C$1:C$500)","v":{"$error":"#VALUE!"}},{"$f":"SUMIF([1]Mapping!$A$1:$A$500,[1]Spreads!$A14,[1]Mapping!D$1:D$500)","v":{"$error":"#VALUE!"}},{"$f":"SUMIF([1]Mapping!$A$1:$A$500,[1]Spreads!$A14,[1]Mapping!E$1:E$500)","v":{"$error":"#VALUE!"}}]
["COGS","51200-Leasing",5252465,0,null,null,null,"Bad Debt Expense",{"$f":"SUMIF([1]Mapping!$A$1:$A$500,[1]Spreads!$A15,[1]Mapping!C$1:C$500)","v":{"$error":"#VALUE!"}},{"$f":"SUMIF([1]Mapping!$A$1:$A$500,[1]Spreads!$A15,[1]Mapping!D$1:D$500)","v":{"$error":"#VALUE!"}},{"$f":"SUMIF([1]Mapping!$A$1:$A$500,[1]Spreads!$A15,[1]Mapping!E$1:E$500)","v":{"$error":"#VALUE!"}}]
{"$rows_left_out":201}
{"sheet":"RiskNotching","index":2,"n_rows":50,"n_cols":52,"rows_kept":50,"cut":false,"hidden":false,"merged":[]}
["Reporting Period and Period Length",null,null,null,"Client Name",null,{"$f":"Analysis!A1","v":"Rikkel Corp"},null,null,null,"Model Risk Rating ",null,"C",null,null,null,null,null,null,null,null,null,"Password:",null,"risk "]
[{"$f":"Analysis!B3","v":"2023-12-31"},{"$f":"Analysis!B3","v":"2023-12-31"},{"$f":"Analysis!C3","v":"2024-12-31"},{"$f":"Analysis!D3","v":"2025-03-31"},null,null,"BB+",1,"BB",2,"BB-",2,"B+",3,"B",4,"B-",5,"C","SS",null,"Risk Grading ",null,null,null,null,"Grade Scaling",null,null,"Divvy Rating","RiskCalc Rating",null,"Rating Definition","Probability of Default","% (up to) of Monthly Revenue",null,null,null,null,null,null,"FYE"]
[12,12,12,null,"Interest Coverage",null,null,null,null,null,null,null,null,null,null,null,null,null,null,null,null,null,null,null,"Weighting",null,"Score","Divvy ","Moodys","A","A",12,"Superior Credit Quality",4.0000000000000002E-4,0.7,null,null,null,null,null,null,"YTD "]
[null,{"$f":"Analysis!B15/Analysis!B34","v":2.3898591549295776},{"$f":"IF(C22=\"\",Analysis!C15/Analysis!C34,C22)","v":2.2783761391880697},{"$f":"Analysis!D15/Analysis!D34","v":4.4176470588235297},"EBITDA / Int Expense",null,">",10.000999999999999,10,5,10,5,4.99,3,2.99,2,1.99,1,"<",0.99,null,"EBITDA / Int Expense",{"$f":"IF(Y4=0,_xlfn.IFS(C4>H4,$G$2,C4>=J4,$I$2,C4>=L4,$K$2,C4>=N4,$M$2,C4>=P4,$O$2,C4>=R4,$Q$2,C4<=T4,$S$2),VLOOKUP(X4,$AA$3:$AC$14,2,0))","v":"B"},{"$f":"IF(Y4=0,VLOOKUP(W4,$AD$3:$AH$13,3,0),VLOOKUP(AQ4,$AD$6:$AH$17,3,0)+Y4)","v":4},0,null,{"$f":"AF3","v":12},{"$f":"AD3","v":"A"},{"$f":"AE3","v":"A"},"BBB+","Baa1",11,"Investment Grade Quality",2.8999999999999998E-3,0.6,null,null,null,null,null,null,"TTM",{"$f":"_xlfn.IFS(C4>H4,$G$2,C4>=J4,$I$2,C4>=L4,$K$2,C4>=N4,$M$2,C4>=P4,$O$2,C4>=R4,$Q$2,C4<T4,$S$2)","v":"B"}]
[null,{"$f":"Analysis!B38/Analysis!B34","v":2.3898591549295776},{"$f":"IF(C23=\"\",Analysis!C38/Analysis!C34,C23)","v":2.256006628003314},{"$f":"Analysis!D38/Analysis!D34","v":4.2588235294117647},"EBIT / Interest Expense",null,">",8.0009999999999994,8,4,8,4,3.99,2,1.99,1,0.99,0,"<",1.0000000000000001E-5,null,"EBIT / Interest Expense",{"$f":"IF(Y5=0,_xlfn.IFS(C5>H5,$G$2,C5>=J5,$I$2,C5>=L5,$K$2,C5>=N5,$M$2,C5>=P5,$O$2,C5>=R5,$Q$2,C5<T5,$S$2),VLOOKUP(X5,$AA$3:$AC$14,2,0))","v":"B+"},{"$f":"IF(Y5=0,VLOOKUP(W5,$AD$3:$AH$13,3,0),VLOOKUP(AQ5,$AD$6:$AH$17,3,0)+Y5)","v":5},0,null,{"$f":"AF4","v":11},{"$f":"AD4","v":"BBB+"},{"$f":"AE4","v":"Baa1"},"BBB ","Baa2",10,"Investment Grade Quality",3.3999999999999998E-3,0.6,0.45,null,null,null,null,null,null,{"$f":"_xlfn.IFS(C5>H5,$G$2,C5>=J5,$I$2,C5>=L5,$K$2,C5>=N5,$M$2,C5>=P5,$O$2,C5>=R5,$Q$2,C5<T5,$S$2)","v":"B+"}]
[null,{"$f":"Analysis!B15/(Analysis!B34+Analysis!B26+Analysis!B29+Analysis!B25+Analysis!C25)","v":1.8646153846153846},{"$f":"IF(C24=\"\",Analysis!C15/(Analysis!C34+Analysis!C26+Analysis!C29),C24)","v":2.2783761391880697},{"$f":"Analysis!D15/(Analysis!D34+Analysis!D26+Analysis!D29+Analysis!D25)","v":4.4176470588235297},"EBITDA/CPLTD + Int exp",null,">",3.5001000000000002,3.5,2.5,3.5,2.5,2.4900000000000002,1.75,1.74,1.25,1.24,1,"<",0.99,null,"EBITDA/CPLTD + Int exp",{"$f":"IF(Y6=0,_xlfn.IFS(C6>H6,$G$2,C6>=J6,$I$2,C6>=L6,$K$2,C6>=N6,$M$2,C6>=P6,$O$2,C6>=R6,$Q$2,C6<=T6,$S$2),VLOOKUP(X6,$AA$3:$AC$14,2,0))","v":{"$error":"#N/A"}},{"$f":"IF(Y6=0,VLOOKUP(W6,$AD$3:$AH$13,3,0),VLOOKUP(AQ6,$AD$6:$AH$17,3,0)+Y6)","v":1},-4,null,{"$f":"AF5","v":10},{"$f":"AD5","v":"BBB "},{"$f":"AE5","v":"Baa2"},"BBB-","Baa3",9,"Investment Grade Quality",4.4999999999999997E-3,0.6,0.45,null,null,null,null,null,null,{"$f":"_xlfn.IFS(C6>H6,$G$2,C6>=J6,$I$2,C6>=L6,$K$2,C6>=N6,$M$2,C6>=P6,$O$2,C6>=R6,$Q$2,C6<T6,$S$2)","v":"B+"}]
[null,null,null,null,"Profitability and Scale",null,null,null,null,null,null,null,null,null,null,null,null,null,null,null,null,null,null,null,null,null,9,"BBB-","Baa3","BB+","Ba1",8,"Speculative Quality",6.3E-3,0.5,0.45]
[null,{"$f":"IF(Analysis!G2=\"YES\",Analysis!B4/1000,Analysis!B4/1000000)","v":99.227999999999994},{"$f":"IF(Analysis!G2=\"YES\",IF(C26=\"\",Analysis!C4/1000,C26),IF(C26=\"\",Analysis!C4/1000000,C26))","v":102.503},{"$f":"IF(Analysis!G2=\"YES\",Analysis!D4/1000,Analysis!D4/1000000)","v":22.088999999999999},"Revenue (USD MM)",null,">",50.000999999999998,50,30,50,30,29.99,20,19.989999999999998,12.5,12.49,5,"<",4.99,null,"Revenue (USD MM)",{"$f":"IF(Y8=0,_xlfn.IFS(C8>H8,$G$2,C8>=J8,$I$2,C8>=L8,$K$2,C8>=N8,$M$2,C8>=P8,$O$2,C8>=R8,$Q$2,C8<=T8,$S$2),VLOOKUP(X8,$AA$3:$AC$14,2,0))","v":"B"},{"$f":"IF(Y8=0,VLOOKUP(W8,$AD$3:$AH$13,3,0),VLOOKUP(AQ8,$AD$6:$AH$17,3,0)+Y8)","v":4},-4,null,8,"BB+","Ba1","BB","Ba2",7,"Speculative Quality",1.1299999999999999E-2,0.45,0.35,null,null,null,null,null,null,{"$f":"_xlfn.IFS(C8>H8,$G$2,C8>=J8,$I$2,C8>=L8,$K$2,C8>=N8,$M$2,C8>=P8,$O$2,C8>=R8,$Q$2,C8<T8,$S$2)","v":"BB+"}]
[null,{"$f":"Analysis!B15/Analysis!B4*100","v":4.2750030233401866},{"$f":"IF(C27=\"\",Analysis!C15/Analysis!C4*100,C27)","v":2.6828483068788231},{"$f":"Analysis!D15/Analysis!D4*100","v":3.3998822943546561},"EBITDA Margin (%)",null,">",5.0000999999999998,5,3,5,3,2.99,2,1.99,1,0.99,0,"<",0,null,"EBITDA Margin (%)",{"$f":"IF(Y9=0,_xlfn.IFS(C9>H9,$G$2,C9>=J9,$I$2,C9>=L9,$K$2,C9>=N9,$M$2,C9>=P9,$O$2,C9>=R9,$Q$2,C9<T9,$S$2),VLOOKUP(X9,$AA$3:$AC$14,2,0))","v":{"$error":"#N/A"}},{"$f":"IF(Y9=0,VLOOKUP(W9,$AD$3:$AH$13,3,0),VLOOKUP(AQ9,$AD$6:$AH$17,3,0)+Y9)","v":1},-4,null,7,"BB","Ba2","BB-","Ba3",6,"Speculative Quality",2.23E-2,0.4,0.35,null,null,null,null,null,null,{"$f":"_xlfn.IFS(C9>H9,$G$2,C9>=J9,$I$2,C9>=L9,$K$2,C9>=N9,$M$2,C9>=P9,$O$2,C9>=R9,$Q$2,C9<T9,$S$2)","v":"B+"}]
[null,null,null,null,"Liquidity",null,null,null,null,null,null,null,null,null,null,null,null,null,null,null,null,null,null,null,null,null,6,"BB-","Ba3","B+","B1",5,"Speculative Quality with High Risk",3.0300000000000001E-2,0.3,0.3]
[null,{"$f":"Analysis!B11/Analysis!B35*100","v":9.1045555410520826},{"$f":"IF(C29=\"\",Analysis!C11/Analysis!C35*100,C29)","v":0.94909926248337562},{"$f":"(Analysis!D11/Analysis!D35)*100","v":1.8990073370738023},"Cash / Total Assets (%)",null,">",10.000999999999999,10,5,10,5,4.99,2,1.99,1.5,1.49,1,"<",0.99,null,"Cash / Total Assets (%)",{"$f":"IF(Y11=0,_xlfn.IFS(C11>H11,$G$2,C11>=J11,$I$2,C11>=L11,$K$2,C11>=N11,$M$2,C11>=P11,$O$2,C11>=R11,$Q$2,C11<=T11,$S$2),VLOOKUP(X11,$AA$3:$AC$14,2,0))","v":{"$error":"#N/A"}},{"$f":"IF(Y11=0,VLOOKUP(W11,$AD$3:$AH$13,3,0),VLOOKUP(AQ11,$AD$6:$AH$17,3,0)+Y11)","v":-2},-4,null,5,"B+","B1","B","B2",4,"Speculative Quality with High Risk",5.9299999999999999E-2,0.15,0.15,null,null,null,null,null,null,{"$f":"_xlfn.IFS(C11>H11,$G$2,C11>=J11,$I$2,C11>=L11,$K$2,C11>=N11,$M$2,C11>=P11,$O$2,C11>=R11,$Q$2,C11<T11,$S$2)","v":"C"}]
[null,{"$f":"Analysis!B13","v":1.2185163443829641},{"$f":"IF(C30=\"\",Analysis!C13,C30)","v":1.2636475517363559},{"$f":"Analysis!D13","v":1.316646465133515},"Current Ratio",null,">",3.0009999999999999,3,2,3,2,1.99,1,0.99,0.75,0.74,0.5,"<",0.49,null,"Current Ratio",{"$f":"IF(Y12=0,_xlfn.IFS(C12>H12,$G$2,C12>=J12,$I$2,C12>=L12,$K$2,C12>=N12,$M$2,C12>=P12,$O$2,C12>=R12,$Q$2,C12<=T12,$S$2),VLOOKUP(X12,$AA$3:$AC$14,2,0))","v":"B+"},{"$f":"IF(Y12=0,VLOOKUP(W12,$AD$3:$AH$13,3,0),VLOOKUP(AQ12,$AD$6:$AH$17,3,0)+Y12)","v":5},0,null,4,"B","B2","B-","B3",3,"Speculative Quality with High Risk",0.1077,0.05,0.05,null,null,null,null,null,null,{"$f":"_xlfn.IFS(C12>H12,$G$2,C12>=J12,$I$2,C12>=L12,$K$2,C12>=N12,$M$2,C12>=P12,$O$2,C12>=R12,$Q$2,C12<T12,$S$2)","v":"B+"}]
[null,{"$f":"Analysis!B12","v":0.16011759046827659},{"$f":"IF(C31=\"\",Analysis!C12,C31)","v":0.10915645695460199},{"$f":"Analysis!D12","v":0.14390601297178701},"Quick Ratio",null,">",2.5001000000000002,2.5,1.5,2.5,1.5,1.49,0.5,0.49,0.3,0.28999999999999998,0.1,"<",0.09,null,"Quick Ratio",{"$f":"IF(Y13=0,_xlfn.IFS(C13>H13,$G$2,C13>=J13,$I$2,C13>=L13,$K$2,C13>=N13,$M$2,C13>=P13,$O$2,C13>=R13,$Q$2,C13<=T13,$S$2),VLOOKUP(X13,$AA$3:$AC$14,2,0))","v":"B-"},{"$f":"IF(Y13=0,VLOOKUP(W13,$AD$3:$AH$13,3,0),VLOOKUP(AQ13,$AD$6:$AH$17,3,0)+Y13)","v":3},0,null,3,"B-","B3","C","C",2,"Poorest Quality and Typically in Default",0.99,2.5000000000000001E-2,2.5000000000000001E-2,null,null,null,null,null,null,{"$f":"_xlfn.IFS(C13>H13,$G$2,C13>=J13,$I$2,C13>=L13,$K$2,C13>=N13,$M$2,C13>=P13,$O$2,C13>=R13,$Q$2,C13<T13,$S$2)","v":"B-"}]
[null,null,null,null,"Cash Flow / Leverage",null,null,null,null,null,null,null,null,null,null,null,null,null,null,null,null,null,null,null,null,null,2,"C","C"]
[null,{"$f":"(Analysis!B31-Analysis!B30-Analysis!B20)/(Analysis!B15)","v":1.2102781706742103},{"$f":"IF(C33=\"\",(Analysis!C31-Analysis!C30-Analysis!C20)/(Analysis!C15),C33)","v":2.0989090909090908},{"$f":"(Analysis!D31-Analysis!D30-Analysis!D20)/(Analysis!D15)","v":6.5392809587217045},"Debt / EBITDA Ratio",null,"<",2.4900000000000002,2.5,3.49,2.5,3.49,3.5,4.49,4.5,5.25,5.26,6,">",6,null,"Debt / EBITDA Ratio",{"$f":"IF(Y15=0,IF(C15<=0,\"C\",_xlfn.IFS(C15<H15,$G$2,C15<=J15,$I$2,C15<=L15,$K$2,C15<=N15,$M$2,C15<=P15,$O$2,C15<=R15,$Q$2,C15>T15,$S$2)),VLOOKUP(X15,$AA$3:$AC$14,2,0))","v":"BB+"},{"$f":"IF(Y15=0,VLOOKUP(W15,$AD$3:$AH$13,3,0),VLOOKUP(AQ15,$AD$3:$AH$17,3,0)+Y15)","v":8},0,null,null,null,null,"No",null,null,null,null,null,null,null,null,null,null,null,null,{"$f":"IF(C15<=0,\"C\",_xlfn.IFS(C15<H15,$G$2,C15<=J15,$I$2,C15<=L15,$K$2,C15<=N15,$M$2,C15<=P15,$O$2,C15<=R15,$Q$2,C15>T15,$S$2))","v":"BB+"}]
{"$rows_left_out":36}
{"sheet":"Face Page Input","index":3,"n_rows":47,"n_cols":14,"rows_kept":47,"cut":false,"hidden":false,"merged":[]}
[null,"Input",null,null,"Output",null,"Override"]
[]
["Credit Rating for: ",null,null,null,{"$f":"IF(G3=\"\",A3 &RiskNotching!G1,A3 & G3)","v":"Credit Rating for: Rikkel Corp"}]
["Budgets / Users: ",3,null,null,{"$f":"IF(G4=\"\",A31&\"\"&DOLLAR(B31,0),A31&\" \"&DOLLAR(G4,0))","v":"Requested Limit: $2,000,000"}]
["Users:",78,null,null,{"$f":"IF(G5=\"\",A32 & DOLLAR(B32,0),A32 & DOLLAR(G5,0))","v":"Approved Limit: $2,000,000"}]
["Bank Connection:","No",null,null,{"$f":"IF(B18=\"\",A33 & \" \" & DOLLAR(B33,0),A18& \" \" &DOLLAR(B18,0))","v":"Previous Limit: $800,000"}]
["Pay Cycle: ","net25",null,null,{"$f":"IF(B7=\"\",IF(G7=\"\",A35& \"\" & B35,A35&\" \"&G7),IF(G7=\"\",A7&\" \"&B7,A7&\" \"&G7))","v":"Pay Cycle:  net25"}]
["Previous Rating (Auto UW):","b",null,null,{"$f":"IF(G8=\"\",A4 & B4 & \"/\" &B5,A4 & \" \" & G8)","v":"Budgets / Users: 3/78"}]
["#30/60/90 DPD:",3,null,null,{"$f":"A6 & \" \" & B6","v":"Bank Connection: No"}]
["/60/",3,null,null,{"$f":"IF(G10=\"\",A39 & B39,A39 & \" \" &G10)","v":"Underwriter: Darrell Day"}]
["#NSF:",1,null,null,{"$f":"IF(G11=\"\",A34 & \"  \" & B34,A34 & \"  \" & G11)","v":"Approved Rating:  4 (B)"}]
["Avg 3 Month Spend:",0,null,null,{"$f":"IF(G12=\"\",A37&\" \"&MONTH(B37)&\"/\"&DAY(B37)&\"/\"&YEAR(B37),A37& \" \" & G12)","v":"Rating Date: 6/5/2025"}]
["Patronus Score/ PD: ","C1",null,null,{"$f":"IF(B8=\"\",IF(G13=\"\",A34&\" \"&B34,A8 &\" \"&G13),IF(G13=\"\", A8 & \" \" & VLOOKUP(B8,'FP Dropdowns & OTher'!E1:F7,2,FALSE),A8&\" \"&G13))","v":"Previous Rating (Auto UW): 4 (B)"}]
["PD:",0.23705501600000001,null,null,{"$f":"IF(G14=\"\",A9 & \" \" & B9 &\"/\" &B10,A9 & \" \" & G14)","v":"#30/60/90 DPD: 3/3"}]
["Industry Type:","Electrical Contractors and Other Wiring Installation Contractors",null,null,{"$f":"IF(G15=\"\",A11 & \" \" & B11, A11 & \" \" & G15)","v":"#NSF: 1"}]
{"$rows_left_out":33}
{"sheet":"AI Prompt","index":4,"n_rows":0,"n_cols":0,"rows_kept":0,"cut":false,"hidden":true,"merged":[]}

{"sheet":"Sheet1","index":5,"n_rows":0,"n_cols":0,"rows_kept":0,"cut":false,"hidden":true,"merged":[]}

{"sheet":"Ranges","index":6,"n_rows":24,"n_cols":4,"rows_kept":24,"cut":false,"hidden":true,"merged":[]}
["Revenue"]
["o   Satisfactory",">",30,"MM"]
["o   Sufficient ","Between"]
["o   Limited","<",12.5,"MM"]
["Profitability"]
["o   Satisfactory",">",0.05,"net profit margin"]
["o   Sufficient ","Between"]
["o   Unsatisfactory","<",0,"net profit margin"]
["Liquidity"]
["o   Satisfactory",">",2,"Current Ratio"]
["o   Sufficient ","Between"]
["o   Unsatisfactory","<",1,"Current Ratio"]
["Cashflow"]
["o   Satisfactory",">",2,"times the requested line in EBITDA"]
["o   Sufficient ","Between"]
{"$rows_left_out":10}
{"sheet":"Wording","index":7,"n_rows":17,"n_cols":8,"rows_kept":17,"cut":false,"hidden":true,"merged":[]}
["Revenue & Profitability 1",null,null,"Revenue & Profitability 2",null,"Revenue & Profitability 3"]
["satisfactory","increasing ",null,"improved",null,"satisfactory","improving ","net income"]
["sufficient","decreasing",null,"contracting",null,"sufficient","contracting","net losses"]
["limited",null,null,null,null,"limited"]
[]
["Liquidity & Cash Flow 1",null,null,"Liquidity & Cash Flow 2",null,"Liquidity & Cash Flow3"]
["satisfactory",null,null,"satisfactory",null,"satisfactory","increase "]
["sufficient",null,null,"sufficient",null,"sufficient","decrease"]
["limited",null,null,"limited",null,"limited"]
[]
["SOLVENCY & LEVERAGE 1",null,null,"SOLVENCY & LEVERAGE 2"]
["has satisfactory solvency",null,null,"satisfactory"]
["is sufficiently solvent",null,null,"sufficient"]
["is highly levered",null,null,"limited"]
[]
{"$rows_left_out":3}
{"sheet":"FP Dropdowns & OTher","index":8,"n_rows":7,"n_cols":6,"rows_kept":7,"cut":false,"hidden":true,"merged":[]}
["1 (BB+)",null,"Net 25",null,"bb+","1 (BB+)"]
["2 (BB)",null,"Monthly",null,"bb+","2 (BB)"]
["2 (BB-)",null,"Semi-monthly",null,"bb-","2 (BB-)"]
["3 (B+)",null,"Weekly",null,"b+","3 (B+)"]
["4 (B)",null,"Daily",null,"b","4 (B)"]
["5 (B-)",null,null,null,"b-","5 (B-)"]
["SS (C)",null,null,null,"C","SS (C)"]